Pt(1,1-cbda)(NH2Me)2
- Formula: C8H16N2O4Pt
- Molecular weight: 399.308

Gas phase thermochemistry data

Data compiled by: José A. Martinho Simões
Quantity | Value | Units | Method | Reference | Comment |
---|---|---|---|---|---|
ΔfH°gas | -601. ± 22. | kJ/mol | Review | Martinho Simões | The enthalpy of formation relies on -424.2 ± 8.3 kJ/mol for the enthalpy of formation of cis-Pt(Cl)2(NH2Me)2(cr). |

Condensed phase thermochemistry data

Data compiled by: José A. Martinho Simões
Quantity | Value | Units | Method | Reference | Comment |
---|---|---|---|---|---|
ΔfH°solid | -919.1 ± 8.4 | kJ/mol | Review | Martinho Simões | The enthalpy of formation relies on -424.2 ± 8.3 kJ/mol for the enthalpy of formation of cis-Pt(Cl)2(NH2Me)2(cr). |

Phase change data

Data compiled by: José A. Martinho Simões
Quantity | Value | Units | Method | Reference | Comment |
---|---|---|---|---|---|
ΔsubH° | 318. ± 20. | kJ/mol | RSC | Mortimer, 1984 |

References

Martinho Simões
Martinho Simões, J.A.,
Private communication (see http://webbook.nist.gov/chemistry/om/). [all data]