Pt(1,1-cbda)(NH3)2
- Formula: C6H12N2O4Pt
- Molecular weight: 371.254

Gas phase thermochemistry data

Data compiled by: José A. Martinho Simões
Quantity | Value | Units | Method | Reference | Comment |
---|---|---|---|---|---|
ΔfH°gas | -668. ± 20. | kJ/mol | Review | Martinho Simões | The enthalpy of formation relies on -467.2 ± 3.0 kJ/mol for the enthalpy of formation of cis-Pt(Cl)2(NH3)2(cr). |

Condensed phase thermochemistry data

Data compiled by: José A. Martinho Simões
Quantity | Value | Units | Method | Reference | Comment |
---|---|---|---|---|---|
ΔfH°solid | -968.2 ± 3.2 | kJ/mol | Review | Martinho Simões | The enthalpy of formation relies on -467.2 ± 3.0 kJ/mol for the enthalpy of formation of cis-Pt(Cl)2(NH3)2(cr). |

Phase change data

Data compiled by: José A. Martinho Simões
Quantity | Value | Units | Method | Reference | Comment |
---|---|---|---|---|---|
ΔsubH° | 300. ± 20. | kJ/mol | RSC | Mortimer, 1984 |

References

Martinho Simões
Martinho Simões, J.A.,
Private communication (see http://webbook.nist.gov/chemistry/om/). [all data]