Pt[(OOC)2CHEt](NH2Et)2
- Formula: C9H20N2O4Pt
- Molecular weight: 415.350

Condensed phase thermochemistry data

Data compiled by: José A. Martinho Simões
Quantity | Value | Units | Method | Reference | Comment |
---|---|---|---|---|---|
ΔfH°solid | -1092. ± 10. | kJ/mol | Review | Martinho Simões | The enthalpy of formation relies on -490. ± 10. kJ/mol for the estimated enthalpy of formation of cis-Pt(Cl)2(NH2Et)2(cr) Al-Takhin, Pilcher, et al., 1983. |

Phase change data

Data compiled by: José A. Martinho Simões
Quantity | Value | Units | Method | Reference | Comment |
---|---|---|---|---|---|
ΔsubH° | 328. ± 20. | kJ/mol | RSC | Mortimer, 1984 |

Gas phase thermochemistry data

Data compiled by: José A. Martinho Simões
Quantity | Value | Units | Method | Reference | Comment |
---|---|---|---|---|---|
ΔfH°gas | -182.6 ± 5.4 | kcal/mol | Review | Martinho Simões | The enthalpy of formation relies on -117. ± 2.4 kcal/mol for the estimated enthalpy of formation of cis-Pt(Cl)2(NH2Et)2(cr) Al-Takhin, Pilcher, et al., 1983. |

References

Martinho Simões
Martinho Simões, J.A.,
Private communication (see http://webbook.nist.gov/chemistry/om/). [all data]
Al-Takhin, Pilcher, et al., 1983
Al-Takhin, G.; Pilcher, G.; Bickerton, J.; Zaki, A.A.,
J. Chem. Soc., Dalton Trans., 1983, 2657; Pilcher, G. personal communication. [all data]
Mortimer, 1984
Mortimer, C.T.,
Rev. Inorg. Chem., 1984, 6, 233. [all data]