Pt[(OOC)2CH2][C2H4(NH2)2]
- Formula: C5H10N2O4Pt
- Molecular weight: 357.228

Condensed phase thermochemistry data

Data compiled by: José A. Martinho Simões
Quantity | Value | Units | Method | Reference | Comment |
---|---|---|---|---|---|
ΔfH°solid | -982.6 ± 6.5 | kJ/mol | Review | Martinho Simões | The enthalpy of formation relies on -437.0 ± 6.5 kJ/mol for the enthalpy of formation of cis-Pt(Cl)2[C2H4(NH2)2](cr). |

Phase change data

Data compiled by: José A. Martinho Simões
Quantity | Value | Units | Method | Reference | Comment |
---|---|---|---|---|---|
ΔsubH° | 290. ± 20. | kJ/mol | RSC | Mortimer, 1984 |

Gas phase thermochemistry data

Data compiled by: José A. Martinho Simões
Quantity | Value | Units | Method | Reference | Comment |
---|---|---|---|---|---|
ΔfH°gas | -165.5 ± 5.0 | kcal/mol | Review | Martinho Simões | The enthalpy of formation relies on -104.4 ± 1.6 kcal/mol for the enthalpy of formation of cis-Pt(Cl)2[C2H4(NH2)2](cr). |

References

Martinho Simões
Martinho Simões, J.A.,
Private communication (see http://webbook.nist.gov/chemistry/om/). [all data]
Mortimer, 1984
Mortimer, C.T.,
Rev. Inorg. Chem., 1984, 6, 233. [all data]