Pt(PPh3)2(pcbd)
- Formula: C46H36O2P2Pt
- Molecular weight: 877.808

Phase change data

Data compiled by: José A. Martinho Simões
Quantity | Value | Units | Method | Reference | Comment |
---|---|---|---|---|---|
ΔsubH° | 64.5 ± 4.8 | kcal/mol | N/A | Mortimer, 1984 |

References

Mortimer, 1984
Mortimer, C.T.,
Rev. Inorg. Chem., 1984, 6, 233. [all data]