Pt(PPh3)2[C2(CN)4]
- Formula: C42H30N4P2Pt
- Molecular weight: 847.746

Phase change data

Data compiled by: José A. Martinho Simões
Quantity | Value | Units | Method | Reference | Comment |
---|---|---|---|---|---|
ΔsubH° | 260. ± 20. | kJ/mol | RSC | Mortimer, 1984 |

Gas phase thermochemistry data

Data compiled by: José A. Martinho Simões
Quantity | Value | Units | Method | Reference | Comment |
---|---|---|---|---|---|
ΔfH°gas | 294.6 ± 7.2 | kcal/mol | Review | Martinho Simões | The enthalpy of formation relies on 113.8 ± 4.8 kcal/mol for the enthalpy of formation of Pt(PPh3)2(C2H4)(cr). |

Condensed phase thermochemistry data

Data compiled by: José A. Martinho Simões
Quantity | Value | Units | Method | Reference | Comment |
---|---|---|---|---|---|
ΔfH°solid | 232.5 ± 5.4 | kcal/mol | Review | Martinho Simões | The enthalpy of formation relies on 113.8 ± 4.8 kcal/mol for the enthalpy of formation of Pt(PPh3)2(C2H4)(cr). |

References

Mortimer, 1984
Mortimer, C.T.,
Rev. Inorg. Chem., 1984, 6, 233. [all data]