Pt(PPh3)2(trans-C2H2Ph2)
- Formula: C50H42P2Pt
- Molecular weight: 899.900

Phase change data

Data compiled by: José A. Martinho Simões
Quantity | Value | Units | Method | Reference | Comment |
---|---|---|---|---|---|
ΔsubH° | 66.9 | kcal/mol | N/A | Mortimer, 1984 |

References

Mortimer, 1984
Mortimer, C.T.,
Rev. Inorg. Chem., 1984, 6, 233. [all data]