Pt(PPh3)2(CH2CHPh)
- Formula: C44H37P2Pt
- Molecular weight: 822.796

Phase change data

Data compiled by: José A. Martinho Simões
Quantity | Value | Units | Method | Reference | Comment |
---|---|---|---|---|---|
ΔsubH° | 60.9 | kcal/mol | N/A | Mortimer, 1984 |

References

Mortimer, 1984
Mortimer, C.T.,
Rev. Inorg. Chem., 1984, 6, 233. [all data]