Pt(PPh3)2(CS2)
- Formula: C37H30P2PtS2
- Molecular weight: 795.796

Gas phase thermochemistry data

Data compiled by: José A. Martinho Simões
Quantity | Value | Units | Method | Reference | Comment |
---|---|---|---|---|---|
ΔfH°gas | 741. ± 28. | kJ/mol | Review | Martinho Simões | The enthalpy of formation relies on 476. ± 20. kJ/mol for the enthalpy of formation of Pt(PPh3)2(C2H4)(cr). |

Condensed phase thermochemistry data

Data compiled by: José A. Martinho Simões
Quantity | Value | Units | Method | Reference | Comment |
---|---|---|---|---|---|
ΔfH°solid | 496. ± 20. | kJ/mol | Review | Martinho Simões | The enthalpy of formation relies on 476. ± 20. kJ/mol for the enthalpy of formation of Pt(PPh3)2(C2H4)(cr). |

Phase change data

Data compiled by: José A. Martinho Simões
Quantity | Value | Units | Method | Reference | Comment |
---|---|---|---|---|---|
ΔsubH° | 245. ± 20. | kJ/mol | RSC | Mortimer, 1984 |

References

Martinho Simões
Martinho Simões, J.A.,
Private communication (see http://webbook.nist.gov/chemistry/om/). [all data]