Pt(PPh3)2(C2Ph2)
- Formula: C50H40P2Pt
- Molecular weight: 897.884

Condensed phase thermochemistry data

Data compiled by: José A. Martinho Simões
Quantity | Value | Units | Method | Reference | Comment |
---|---|---|---|---|---|
ΔfH°solid | 754. ± 20. | kJ/mol | Review | Martinho Simões | The enthalpy of formation relies on 194. ± 12. kJ/mol for the enthalpy of formation of cis-Pt(PPh3)2(Cl)2(cr). |

Phase change data

Data compiled by: José A. Martinho Simões
Quantity | Value | Units | Method | Reference | Comment |
---|---|---|---|---|---|
ΔsubH° | 285. ± 20. | kJ/mol | RSC | Al Takhin, Skinner, et al., 1984 |

Gas phase thermochemistry data

Data compiled by: José A. Martinho Simões
Quantity | Value | Units | Method | Reference | Comment |
---|---|---|---|---|---|
ΔfH°gas | 248.2 ± 6.7 | kcal/mol | Review | Martinho Simões | The enthalpy of formation relies on 46.3 ± 2.8 kcal/mol for the enthalpy of formation of cis-Pt(PPh3)2(Cl)2(cr). |

Reaction thermochemistry data

Data compiled by: José A. Martinho Simões
Individual Reactions
C50H40P2Pt (cr) + (g) = C51H40ClP2Pt (cr)
By formula: C50H40P2Pt (cr) + HCl (g) = C51H40ClP2Pt (cr)
Quantity | Value | Units | Method | Reference | Comment |
---|---|---|---|---|---|
ΔrH° | -22. ± 1. | kcal/mol | RSC | Evans, Mortimer, et al., 1975 |

References

Martinho Simões
Martinho Simões, J.A.,
Private communication (see http://webbook.nist.gov/chemistry/om/). [all data]
Al Takhin, Skinner, et al., 1984
Al Takhin, G.; Skinner, H.A.; Zaki, A.A.,
J. Chem. Soc., Dalton Trans., 1984, 371.. [all data]