Pt(PPh3)2(C2H4)
- Formula: C38H34P2Pt
- Molecular weight: 747.708

Condensed phase thermochemistry data

Data compiled by: José A. Martinho Simões
Quantity | Value | Units | Method | Reference | Comment |
---|---|---|---|---|---|
ΔfH°solid | 476. ± 20. | kJ/mol | Review | Martinho Simões | The enthalpy of formation relies on 754. ± 20. kJ/mol for the enthalpy of formation of Pt(PPh3)2(C2Ph2)(cr). |

Phase change data

Data compiled by: José A. Martinho Simões
Quantity | Value | Units | Method | Reference | Comment |
---|---|---|---|---|---|
ΔsubH° | 230. ± 20. | kJ/mol | RSC | Al Takhin, Skinner, et al., 1984 |

Gas phase thermochemistry data

Data compiled by: José A. Martinho Simões

Quantity Value Units Method Reference Comment
Δfgas706. ± 28.kJ/molReviewMartinho SimõesThe enthalpy of formation relies on 754. ± 20. kJ/mol for the enthalpy of formation of Pt(PPh3)2(C2Ph2)(cr).

References

Martinho Simões
Martinho Simões, J.A.,
Private communication (see http://webbook.nist.gov/chemistry/om/). [all data]
Al Takhin, Skinner, et al., 1984
Al Takhin, G.; Skinner, H.A.; Zaki, A.A.,
J. Chem. Soc., Dalton Trans., 1984, 371.. [all data]