cis-Pt(PPh3)2(I)(Me)
- Formula: C37H33IP2Pt
- Molecular weight: 861.594

Condensed phase thermochemistry data

Data compiled by: José A. Martinho Simões
Quantity | Value | Units | Method | Reference | Comment |
---|---|---|---|---|---|
ΔfH°solid | 359. ± 20. | kJ/mol | Review | Martinho Simões | The enthalpy of formation relies on 476. ± 20. kJ/mol for the enthalpy of formation of Pt(PPh3)2(C2H4)(cr). |

Phase change data

Data compiled by: José A. Martinho Simões
Quantity | Value | Units | Method | Reference | Comment |
---|---|---|---|---|---|
ΔsubH° | 264. ± 20. | kJ/mol | RSC | Mortimer, 1984 |

Gas phase thermochemistry data

Data compiled by: José A. Martinho Simões
Quantity | Value | Units | Method | Reference | Comment |
---|---|---|---|---|---|
ΔfH°gas | 148.9 ± 6.8 | kcal/mol | Review | Martinho Simões | The enthalpy of formation relies on 113.8 ± 4.8 kcal/mol for the enthalpy of formation of Pt(PPh3)2(C2H4)(cr). |

References

Martinho Simões
Martinho Simões, J.A.,
Private communication (see http://webbook.nist.gov/chemistry/om/). [all data]
Mortimer, 1984
Mortimer, C.T.,
Rev. Inorg. Chem., 1984, 6, 233. [all data]