cis-Pt(PPh3)2(I)2
- Formula: C36H30I2P2Pt
- Molecular weight: 973.464

Condensed phase thermochemistry data

Data compiled by: José A. Martinho Simões
Quantity | Value | Units | Method | Reference | Comment |
---|---|---|---|---|---|
ΔfH°solid | 338. ± 21. | kJ/mol | Review | Martinho Simões | The enthalpy of formation relies on 476. ± 20. kJ/mol for the enthalpy of formation of Pt(PPh3)2(C2H4)(cr). |

Phase change data

Data compiled by: José A. Martinho Simões
Quantity | Value | Units | Method | Reference | Comment |
---|---|---|---|---|---|
ΔsubH° | 304. ± 15. | kJ/mol | RSC | Mortimer, 1984 |

Gas phase thermochemistry data

Data compiled by: José A. Martinho Simões
Quantity | Value | Units | Method | Reference | Comment |
---|---|---|---|---|---|
ΔfH°gas | 153.5 ± 6.2 | kcal/mol | Review | Martinho Simões | The enthalpy of formation relies on 113.8 ± 4.8 kcal/mol for the enthalpy of formation of Pt(PPh3)2(C2H4)(cr). |

References

Martinho Simões
Martinho Simões, J.A.,
Private communication (see http://webbook.nist.gov/chemistry/om/). [all data]
Mortimer, 1984
Mortimer, C.T.,
Rev. Inorg. Chem., 1984, 6, 233. [all data]