trans-Pt(PPh3)2(Cl)(H)
- Formula: C36H31ClP2Pt
- Molecular weight: 756.116

Condensed phase thermochemistry data

Data compiled by: José A. Martinho Simões
Quantity | Value | Units | Method | Reference | Comment |
---|---|---|---|---|---|
ΔfH°solid | 287. ± 24. | kJ/mol | Review | Martinho Simões | The enthalpy of formation relies on 973. ± 22. kJ/mol for the enthalpy of formation of Pt(PPh3)2[C2(CN)4](cr). |

Phase change data

Data compiled by: José A. Martinho Simões
Quantity | Value | Units | Method | Reference | Comment |
---|---|---|---|---|---|
ΔsubH° | 245. ± 20. | kJ/mol | RSC | Mortimer, 1984 |

Gas phase thermochemistry data

Data compiled by: José A. Martinho Simões

Quantity Value Units Method Reference Comment
Δfgas127.2 ± 7.5kcal/molReviewMartinho SimõesThe enthalpy of formation relies on 232.5 ± 5.4 kcal/mol for the enthalpy of formation of Pt(PPh3)2[C2(CN)4](cr).

References

Martinho Simões
Martinho Simões, J.A.,
Private communication (see http://webbook.nist.gov/chemistry/om/). [all data]
Mortimer, 1984
Mortimer, C.T.,
Rev. Inorg. Chem., 1984, 6, 233. [all data]