trans-Pt(PEt3)2(Cl)2

Phase change data

Data compiled by: José A. Martinho Simões

Quantity Value Units Method Reference Comment
Δsub149. ± 3.kJ/molTD-HFCAl Takhin, Skinner, et al., 1984

Gas phase thermochemistry data

Data compiled by: José A. Martinho Simões

Quantity Value Units Method Reference Comment
Δfgas-495. ± 21.kJ/molReviewMartinho Simões

References

Al Takhin, Skinner, et al., 1984
Al Takhin, G.; Skinner, H.A.; Zaki, A.A., J. Chem. Soc., Dalton Trans., 1984, 371.. [all data]