cis-Pt(Cl)2[1,2-(NH2)2C2H4]
- Formula: C2H8Cl2N2Pt
- Molecular weight: 326.088

Gas phase thermochemistry data

Data compiled by: José A. Martinho Simões
Quantity | Value | Units | Method | Reference | Comment |
---|---|---|---|---|---|
ΔfH°gas | -164. ± 20. | kJ/mol | Review | Martinho Simões |

Condensed phase thermochemistry data

Data compiled by: José A. Martinho Simões
Quantity | Value | Units | Method | Reference | Comment |
---|---|---|---|---|---|
ΔfH°solid | -437.0 ± 6.5 | kJ/mol | Review | Martinho Simões |

Phase change data

Data compiled by: José A. Martinho Simões
Quantity | Value | Units | Method | Reference | Comment |
---|---|---|---|---|---|
ΔsubH° | 273. ± 19. | kJ/mol | TD-HFC | Mortimer, 1984 |

References

Martinho Simões
Martinho Simões, J.A.,
Private communication (see http://webbook.nist.gov/chemistry/om/). [all data]
Mortimer, 1984
Mortimer, C.T.,
Rev. Inorg. Chem., 1984, 6, 233. [all data]