cis-Pt(Cl)2(NH2Bu)2
- Formula: C8H22Cl2N2Pt
- Molecular weight: 412.264

Gas phase thermochemistry data

Data compiled by: José A. Martinho Simões
Quantity | Value | Units | Method | Reference | Comment |
---|---|---|---|---|---|
ΔfH°gas | -322. ± 20. | kJ/mol | Review | Martinho Simões |

Condensed phase thermochemistry data

Data compiled by: José A. Martinho Simões
Quantity | Value | Units | Method | Reference | Comment |
---|---|---|---|---|---|
ΔfH°solid | -646. ± 11. | kJ/mol | Review | Martinho Simões |

Phase change data

Data compiled by: José A. Martinho Simões
Quantity | Value | Units | Method | Reference | Comment |
---|---|---|---|---|---|
ΔsubH° | 324. ± 17. | kJ/mol | TD-HFC | Mortimer, 1984 |

References

Martinho Simões
Martinho Simões, J.A.,
Private communication (see http://webbook.nist.gov/chemistry/om/). [all data]
Mortimer, 1984
Mortimer, C.T.,
Rev. Inorg. Chem., 1984, 6, 233. [all data]