cis-Pt(Cl)2(NH3)2
- Formula: Cl2H6N2Pt
- Molecular weight: 300.051

Gas phase thermochemistry data

Data compiled by: José A. Martinho Simões
Quantity | Value | Units | Method | Reference | Comment |
---|---|---|---|---|---|
ΔfH°gas | -41.4 ± 3.9 | kcal/mol | Review | Martinho Simões |

Condensed phase thermochemistry data

Data compiled by: José A. Martinho Simões
Quantity | Value | Units | Method | Reference | Comment |
---|---|---|---|---|---|
ΔfH°solid | -111.7 ± 0.72 | kcal/mol | Review | Martinho Simões |

Phase change data

Data compiled by: José A. Martinho Simões
Quantity | Value | Units | Method | Reference | Comment |
---|---|---|---|---|---|
ΔsubH° | 70.3 ± 3.8 | kcal/mol | TD-HFC | Al Takhin, Skinner, et al., 1983 |

Reaction thermochemistry data

Data compiled by: José A. Martinho Simões
Individual Reactions
H6Cl2N2Pt (cr) = (cr) + 2
(g) + (4/3)
(g) + (1/3)
(g)
By formula: H6Cl2N2Pt (cr) = Pt (cr) + 2HCl (g) + (4/3)H3N (g) + (1/3)N2 (g)
Quantity | Value | Units | Method | Reference | Comment |
---|---|---|---|---|---|
ΔrH° | 52.9 ± 0.7 | kcal/mol | TD-HFC | Al Takhin, Skinner, et al., 1983 |

References

Martinho Simões
Martinho Simões, J.A.,
Private communication (see http://webbook.nist.gov/chemistry/om/). [all data]
Al Takhin, Skinner, et al., 1983
Al Takhin, G.; Skinner, H.A.; Zaki, A.A.,
J. Chem. Soc., Dalton Trans., 1983, 2323.. [all data]