Pt(Cp)2(Me)2
- Formula: C12H16Pt
- Molecular weight: 355.339

Condensed phase thermochemistry data

Data compiled by: José A. Martinho Simões
Quantity | Value | Units | Method | Reference | Comment |
---|---|---|---|---|---|
ΔfH°solid | 130.4 ± 7.3 | kJ/mol | Review | Martinho Simões | |
Quantity | Value | Units | Method | Reference | Comment |
ΔcH°solid | -7139.2 ± 7.1 | kJ/mol | CC-SB | Tel'noi and Rabinovich, 1977 | Please also see Kharchevnikov and Rabinovich, 1972. |

Phase change data

Data compiled by: José A. Martinho Simões
Quantity | Value | Units | Method | Reference | Comment |
---|---|---|---|---|---|
ΔsubH° | 83.7 ± 4.2 | kJ/mol | CC-SB | Tel'noi and Rabinovich, 1977 |

Gas phase thermochemistry data

Data compiled by: José A. Martinho Simões

Quantity Value Units Method Reference Comment
Δfgas214.1 ± 8.4kJ/molReviewMartinho Simões

References

Martinho Simões
Martinho Simões, J.A.,
Private communication (see http://webbook.nist.gov/chemistry/om/). [all data]
Tel'noi and Rabinovich, 1977
Tel'noi, V.I.; Rabinovich, I.B.,
Russ. Chem. Rev., 1977, 46, 689. [all data]
Kharchevnikov and Rabinovich, 1972
Kharchevnikov, V.M.; Rabinovich, I.B.,
Trudy Khim. Khim.Tekhnol., Gorky, 1972, No. 2, 40. [all data]