trans-Pd(Cl)2(TeEt2)2
- Formula: C8H20Cl2PdTe2
- Molecular weight: 548.77

Gas phase thermochemistry data

Data compiled by: José A. Martinho Simões
Quantity | Value | Units | Method | Reference | Comment |
---|---|---|---|---|---|
ΔfH°gas | -572. ± 20. | kJ/mol | N/A | Mortimer, 1984 | Value corrected based on a set of ancillary data by J.A. Martinho Simões |

Condensed phase thermochemistry data

Data compiled by: José A. Martinho Simões
Quantity | Value | Units | Method | Reference | Comment |
---|---|---|---|---|---|
ΔfH°solid | -764. ± 15. | kJ/mol | N/A | Mortimer, 1984 | Value corrected based on a set of ancillary data by J.A. Martinho Simões |

Phase change data

Data compiled by: José A. Martinho Simões
Quantity | Value | Units | Method | Reference | Comment |
---|---|---|---|---|---|
ΔsubH° | 192. ± 13. | kJ/mol | N/A | Mortimer, 1984 |

References

Mortimer, 1984
Mortimer, C.T.,
Rev. Inorg. Chem., 1984, 6, 233. [all data]