trans-Pd(Cl)2(SEt2)2
- Formula: C8H20Cl2PdS2
- Molecular weight: 357.70

Gas phase thermochemistry data

Data compiled by: José A. Martinho Simões
Quantity | Value | Units | Method | Reference | Comment |
---|---|---|---|---|---|
ΔfH°gas | -429. ± 20. | kJ/mol | Review | Martinho Simões |

Condensed phase thermochemistry data

Data compiled by: José A. Martinho Simões
Quantity | Value | Units | Method | Reference | Comment |
---|---|---|---|---|---|
ΔfH°solid | -554.7 ± 2.2 | kJ/mol | Review | Martinho Simões | The recommended enthalpy of formation of trans-Pd(Cl)2(SEt2)2(cr) in a review by one of the authors of Evans and Mortimer, 1975 is -564. ± 4. kJ/mol Mortimer, 1984. |

Phase change data

Data compiled by: José A. Martinho Simões
Quantity | Value | Units | Method | Reference | Comment |
---|---|---|---|---|---|
ΔsubH° | 126. ± 20. | kJ/mol | RSC | Mortimer, 1984 |

References

Martinho Simões
Martinho Simões, J.A.,
Private communication (see http://webbook.nist.gov/chemistry/om/). [all data]
Evans and Mortimer, 1975
Evans, A.; Mortimer, C.T.,
J. Chem. Thermodyn., 1975, 7, 363. [all data]
Mortimer, 1984
Mortimer, C.T.,
Rev. Inorg. Chem., 1984, 6, 233. [all data]