Nb(OPr)5
- Formula: C15H35NbO5
- Molecular weight: 388.3418

Condensed phase thermochemistry data

Data compiled by: José A. Martinho Simões
Quantity | Value | Units | Method | Reference | Comment |
---|---|---|---|---|---|
ΔfH°liquid | -1701.1 ± 4.2 | kJ/mol | Review | Martinho Simões | |
Quantity | Value | Units | Method | Reference | Comment |
ΔcH°liquid | -10152.1 ± 3.3 | kJ/mol | CC-SB | Tel'noi, Rabinovich, et al., 1972 | Please also see Tel'noi and Rabinovich, 1977. The enthalpy of combustion was quoted from Tel'noi and Rabinovich, 1977 |

Phase change data

Data compiled by: José A. Martinho Simões
Quantity | Value | Units | Method | Reference | Comment |
---|---|---|---|---|---|
ΔvapH° | 102.1 ± 6.7 | kJ/mol | CC-SB | Tel'noi, Rabinovich, et al., 1972 |

Gas phase thermochemistry data

Data compiled by: José A. Martinho Simões
Quantity | Value | Units | Method | Reference | Comment |
---|---|---|---|---|---|
ΔfH°gas | -382.2 ± 1.9 | kcal/mol | Review | Martinho Simões |

References

Martinho Simões
Martinho Simões, J.A.,
Private communication (see http://webbook.nist.gov/chemistry/om/). [all data]
Tel'noi, Rabinovich, et al., 1972
Tel'noi, V.I.; Rabinovich, I.B.; Kozyrkin, B.I.; Salamantin, B.A.; Kir'yanov, K.V.,
Dokl. Akad. Nauk SSSR, 1972, 205, 2, 364. [all data]
Tel'noi and Rabinovich, 1977
Tel'noi, V.I.; Rabinovich, I.B.,
Russ. Chem. Rev., 1977, 46, 689. [all data]