Nb(OMe)5
- Formula: C5H15NbO5
- Molecular weight: 248.0760

Condensed phase thermochemistry data

Data compiled by: José A. Martinho Simões
Quantity | Value | Units | Method | Reference | Comment |
---|---|---|---|---|---|
ΔfH°solid | -1413.4 ± 2.4 | kJ/mol | Review | Martinho Simões | |
Quantity | Value | Units | Method | Reference | Comment |
ΔcH°solid | -3646.4 ± 1.7 | kJ/mol | CC-SB | Tel'noi, Rabinovich, et al., 1972 | Please also see Tel'noi and Rabinovich, 1977. The enthalpy of combustion was quoted from Tel'noi and Rabinovich, 1977 |

Phase change data

Data compiled by: José A. Martinho Simões
Quantity | Value | Units | Method | Reference | Comment |
---|---|---|---|---|---|
ΔsubH° | 80. ± 11. | kJ/mol | CC-SB | Tel'noi, Rabinovich, et al., 1972 |

Gas phase thermochemistry data

Data compiled by: José A. Martinho Simões

Quantity Value Units Method Reference Comment
Δfgas-1333. ± 11.kJ/molReviewMartinho Simões

References

Martinho Simões
Martinho Simões, J.A.,
Private communication (see http://webbook.nist.gov/chemistry/om/). [all data]
Tel'noi, Rabinovich, et al., 1972
Tel'noi, V.I.; Rabinovich, I.B.; Kozyrkin, B.I.; Salamantin, B.A.; Kir'yanov, K.V.,
Dokl. Akad. Nauk SSSR, 1972, 205, 2, 364. [all data]
Tel'noi and Rabinovich, 1977
Tel'noi, V.I.; Rabinovich, I.B.,
Russ. Chem. Rev., 1977, 46, 689. [all data]