Hf(Cp*)(OC6F5)(Me)2
- Formula: C18H21F5HfO
- Molecular weight: 526.84

Reaction thermochemistry data

Data compiled by: José A. Martinho Simões
Individual Reactions
C13H24Hf (solution) + (solution) = C18H21F5HfO (solution) +
(g)
By formula: C13H24Hf (solution) + C6HF5O (solution) = C18H21F5HfO (solution) + CH4 (g)
Quantity | Value | Units | Method | Reference | Comment |
---|---|---|---|---|---|
ΔrH° | -42.59 ± 0.31 | kcal/mol | RSC | Schock and Marks, 1988 | solvent: Toluene |
C18H21F5HfO (solution) + (solution) = C23H18F10HfO2 (solution) +
(g)
By formula: C18H21F5HfO (solution) + C6HF5O (solution) = C23H18F10HfO2 (solution) + CH4 (g)
Quantity | Value | Units | Method | Reference | Comment |
---|---|---|---|---|---|
ΔrH° | -41.11 ± 0.41 | kcal/mol | RSC | Schock and Marks, 1988 | solvent: Toluene |

References

Schock and Marks, 1988
Schock, L.E.; Marks, T.J.,
J. Am. Chem. Soc., 1988, 110, 7701. [all data]