Hf(Cp*)(Me)3
- Formula: C13H24Hf
- Molecular weight: 358.82

Reaction thermochemistry data

Data compiled by: José A. Martinho Simões
Individual Reactions
C13H24Hf (solution) + (solution) = C18H21F5HfO (solution) +
(g)
By formula: C13H24Hf (solution) + C6HF5O (solution) = C18H21F5HfO (solution) + CH4 (g)
Quantity | Value | Units | Method | Reference | Comment |
---|---|---|---|---|---|
ΔrH° | -178.2 ± 1.3 | kJ/mol | RSC | Schock and Marks, 1988 | solvent: Toluene |

References

Schock and Marks, 1988
Schock, L.E.; Marks, T.J.,
J. Am. Chem. Soc., 1988, 110, 7701. [all data]