Hf(Cp*)2(H)2
- Formula: C20H32Hf
- Molecular weight: 450.96

Reaction thermochemistry data

Data compiled by: José A. Martinho Simões
Individual Reactions
C20H32Hf (solution) + (solution) = C20H30HfI2 (solution) +
(g)
By formula: C20H32Hf (solution) + I2 (solution) = C20H30HfI2 (solution) + H2 (g)
Quantity | Value | Units | Method | Reference | Comment |
---|---|---|---|---|---|
ΔrH° | -70.89 ± 0.69 | kcal/mol | RSC | Schock and Marks, 1988 | solvent: Toluene |

References

Schock and Marks, 1988
Schock, L.E.; Marks, T.J.,
J. Am. Chem. Soc., 1988, 110, 7701. [all data]