Zr(Cp)2(Cl)(OEt)
- Formula: C12H15ClOZr
- Molecular weight: 301.924

Condensed phase thermochemistry data

Data compiled by: José A. Martinho Simões
Quantity | Value | Units | Method | Reference | Comment |
---|---|---|---|---|---|
ΔfH°solid | -668.7 ± 4.1 | kJ/mol | Review | Martinho Simões | The enthalpy of formation relies on -314.8 ± 3.9 kJ/mol for the enthalpy of formation of Zr(Cp)2(Cl)(H)(cr) |

Reaction thermochemistry data

Data compiled by: José A. Martinho Simões
Individual Reactions
C10H11ClZr (cr) + (l) = C12H15ClOZr (cr) +
(g)
By formula: C10H11ClZr (cr) + C2H6O (l) = C12H15ClOZr (cr) + H2 (g)
Quantity | Value | Units | Method | Reference | Comment |
---|---|---|---|---|---|
ΔrH° | -76.3 ± 1.3 | kJ/mol | RSC | Diogo, Simoni, et al., 1993 |

References

Martinho Simões
Martinho Simões, J.A.,
Private communication (see http://webbook.nist.gov/chemistry/om/). [all data]
Diogo, Simoni, et al., 1993
Diogo, H.P.; Simoni, J.A.; Minas da Piedade, M.E.; Dias, A.R.; Martinho Simões, J.A.,
J. Am. Chem. Soc., 1993, 115, 2764. [all data]