Zr(Cp)2(Cl)(Cy)

Condensed phase thermochemistry data

Data compiled by: José A. Martinho Simões

Quantity Value Units Method Reference Comment
Δfsolid-429.4 ± 5.7kJ/molReviewMartinho SimõesThe enthalpy of formation relies on -314.8 ± 3.9 kJ/mol for the enthalpy of formation of Zr(Cp)2(Cl)(H)(cr)

References

Martinho Simões
Martinho Simões, J.A., Private communication (see http://webbook.nist.gov/chemistry/om/). [all data]