Zr(Cp)2(Ph)2
- Formula: C22H20Zr
- Molecular weight: 375.618

Phase change data

Data compiled by: José A. Martinho Simões
Quantity | Value | Units | Method | Reference | Comment |
---|---|---|---|---|---|
ΔsubH° | 22.0 ± 1.0 | kcal/mol | CC-SB | Kir'yanov, Tel'noi, et al., 1976 |

Gas phase thermochemistry data

Data compiled by: José A. Martinho Simões

Quantity Value Units Method Reference Comment
Δfgas368. ± 12.kJ/molReviewMartinho Simões

Condensed phase thermochemistry data

Data compiled by: José A. Martinho Simões

Quantity Value Units Method Reference Comment
Δfsolid276. ± 11.kJ/molReviewMartinho Simões
Quantity Value Units Method Reference Comment
Δcsolid-12892. ± 11.kJ/molCC-SBKir'yanov, Tel'noi, et al., 1976Please also see Tel'noi and Rabinovich, 1977.

References

Kir'yanov, Tel'noi, et al., 1976
Kir'yanov, K.V.; Tel'noi, V.I.; Vasil'eva, G.A.; Rabinovich, I.B.,
Dokl. Akad. Nauk SSSR, 1976, 231, 1021. [all data]