Zr(Cp)2(I)2
- Formula: C10H10I2Zr
- Molecular weight: 475.219

Reaction thermochemistry data

Data compiled by: José A. Martinho Simões
Individual Reactions
C12H16Zr (solution) + 2 (solution) = C10H10I2Zr (solution) + 2
(solution)
By formula: C12H16Zr (solution) + 2I2 (solution) = C10H10I2Zr (solution) + 2CH3I (solution)
Quantity | Value | Units | Method | Reference | Comment |
---|---|---|---|---|---|
ΔrH° | -69.60 ± 0.60 | kcal/mol | RSC | Schock and Marks, 1988 | solvent: Toluene |

Condensed phase thermochemistry data

Data compiled by: José A. Martinho Simões

Quantity Value Units Method Reference Comment
Δfsolid-299.4 ± 5.7kJ/molReviewMartinho SimõesThe enthalpy of formation relies on -63.3 ± 4.9 kJ/mol for the enthalpy of formation of Zr(Cp)2(Me)2(cr)

References

Schock and Marks, 1988
Schock, L.E.; Marks, T.J.,
J. Am. Chem. Soc., 1988, 110, 7701. [all data]