Zr(Cp)2(Me)2
- Formula: C12H16Zr
- Molecular weight: 251.479

Condensed phase thermochemistry data

Data compiled by: José A. Martinho Simões
Quantity | Value | Units | Method | Reference | Comment |
---|---|---|---|---|---|
ΔfH°solid | -44.0 ± 2.7 | kJ/mol | Review | Martinho Simões | |
ΔfH°solid | -63.3 ± 4.9 | kJ/mol | Review | Martinho Simões | The enthalpy of formation relies on -538.6 ± 3.3 kJ/mol for the enthalpy of formation of Zr(Cp)2(Cl)2(cr) |
Quantity | Value | Units | Method | Reference | Comment |
ΔcH°solid | -8065.1 ± 2.1 | kJ/mol | CC-SB | Kir'yanov, Tel'noi, et al., 1976 | Please also see Tel'noi and Rabinovich, 1977. |

Phase change data

Data compiled by: José A. Martinho Simões
Quantity | Value | Units | Method | Reference | Comment |
---|---|---|---|---|---|
ΔsubH° | 81.2 ± 2.1 | kJ/mol | CC-SB | Kir'yanov, Tel'noi, et al., 1976 |

Gas phase thermochemistry data

Data compiled by: José A. Martinho Simões
Quantity | Value | Units | Method | Reference | Comment |
---|---|---|---|---|---|
ΔfH°gas | 37.2 ± 3.4 | kJ/mol | Review | Martinho Simões |

Reaction thermochemistry data

Data compiled by: José A. Martinho Simões
Individual Reactions
C12H16Zr (solution) + 2 (solution) = C10H10I2Zr (solution) + 2
(solution)
By formula: C12H16Zr (solution) + 2I2 (solution) = C10H10I2Zr (solution) + 2CH3I (solution)
Quantity | Value | Units | Method | Reference | Comment |
---|---|---|---|---|---|
ΔrH° | -291.2 ± 2.5 | kJ/mol | RSC | Schock and Marks, 1988 | solvent: Toluene |

References

Martinho Simões
Martinho Simões, J.A.,
Private communication (see http://webbook.nist.gov/chemistry/om/). [all data]
Kir'yanov, Tel'noi, et al., 1976
Kir'yanov, K.V.; Tel'noi, V.I.; Vasil'eva, G.A.; Rabinovich, I.B.,
Dokl. Akad. Nauk SSSR, 1976, 231, 1021. [all data]
Tel'noi and Rabinovich, 1977
Tel'noi, V.I.; Rabinovich, I.B.,
Russ. Chem. Rev., 1977, 46, 689. [all data]