Ti(Cp)2(Cl)(Ph)
- Formula: C16H15ClTi
- Molecular weight: 290.610

Phase change data

Data compiled by: José A. Martinho Simões
Quantity | Value | Units | Method | Reference | Comment |
---|---|---|---|---|---|
ΔsubH° | 28.7 ± 2.4 | kcal/mol | RSC | Calhorda, Dias, et al., 1987 |

Condensed phase thermochemistry data

Data compiled by: José A. Martinho Simões

Quantity Value Units Method Reference Comment
Δfsolid-79.6 ± 8.0kJ/molReviewMartinho SimõesThe enthalpy of formation relies on -383.6 ± 7.7 kJ/mol for the enthalpy of formation of Ti(Cp)2(Cl)2(cr)

Gas phase thermochemistry data

Data compiled by: José A. Martinho Simões

Quantity Value Units Method Reference Comment
Δfgas9.7 ± 3.1kcal/molReviewMartinho SimõesThe enthalpy of formation relies on -91.7 ± 1.8 kcal/mol for the enthalpy of formation of Ti(Cp)2(Cl)2(cr)

References

Calhorda, Dias, et al., 1987
Calhorda, M.J.; Dias, A.R.; Minas da Piedade M.E.; Salema, M.S.; Martinho Simões J.A.,
Organometallics, 1987, 6, 734. [all data]