Ti(Cp)2(Cl)(Me)
- Formula: C11H13ClTi
- Molecular weight: 228.541

Gas phase thermochemistry data

Data compiled by: José A. Martinho Simões
Quantity | Value | Units | Method | Reference | Comment |
---|---|---|---|---|---|
ΔfH°gas | -125. ± 13. | kJ/mol | Review | Martinho Simões | The enthalpy of formation relies on -383.6 ± 7.7 kJ/mol for the enthalpy of formation of Ti(Cp)2(Cl)2(cr) |

Reaction thermochemistry data

Data compiled by: José A. Martinho Simões
Individual Reactions
C11H13ClTi (cr) + ( • 4.40
) (solution) =
(cr) +
(g)
By formula: C11H13ClTi (cr) + (HCl • 4.40H2O) (solution) = C10H10Cl2Ti (cr) + CH4 (g)
Quantity | Value | Units | Method | Reference | Comment |
---|---|---|---|---|---|
ΔrH° | -68.9 ± 3.1 | kJ/mol | RSC | Calhorda, Dias, et al., 1987 |

Condensed phase thermochemistry data

Data compiled by: José A. Martinho Simões
Quantity | Value | Units | Method | Reference | Comment |
---|---|---|---|---|---|
ΔfH°solid | -234.9 ± 8.3 | kJ/mol | Review | Martinho Simões | The enthalpy of formation relies on -383.6 ± 7.7 kJ/mol for the enthalpy of formation of Ti(Cp)2(Cl)2(cr) |

Phase change data

Data compiled by: José A. Martinho Simões
Quantity | Value | Units | Method | Reference | Comment |
---|---|---|---|---|---|
ΔsubH° | 110. ± 10. | kJ/mol | RSC | Calhorda, Dias, et al., 1987 |

References

Martinho Simões
Martinho Simões, J.A.,
Private communication (see http://webbook.nist.gov/chemistry/om/). [all data]
Calhorda, Dias, et al., 1987
Calhorda, M.J.; Dias, A.R.; Minas da Piedade M.E.; Salema, M.S.; Martinho Simões J.A.,
Organometallics, 1987, 6, 734. [all data]