Ti(Cp)2(SPh)2
- Formula: C22H20S2Ti
- Molecular weight: 396.391

Gas phase thermochemistry data

Data compiled by: José A. Martinho Simões
Quantity | Value | Units | Method | Reference | Comment |
---|---|---|---|---|---|
ΔfH°gas | 35.1 ± 3.1 | kcal/mol | Review | Martinho Simões | The enthalpy of formation relies on -91.7 ± 1.8 kcal/mol for the enthalpy of formation of Ti(Cp)2(Cl)2(cr) |

Condensed phase thermochemistry data

Data compiled by: José A. Martinho Simões
Quantity | Value | Units | Method | Reference | Comment |
---|---|---|---|---|---|
ΔfH°solid | 8.1 ± 1.9 | kcal/mol | Review | Martinho Simões | The enthalpy of formation relies on -91.7 ± 1.8 kcal/mol for the enthalpy of formation of Ti(Cp)2(Cl)2(cr) |

References

Martinho Simões
Martinho Simões, J.A.,
Private communication (see http://webbook.nist.gov/chemistry/om/). [all data]