Ti(Cp)2(SPr)2
- Formula: C16H24S2Ti
- Molecular weight: 328.359

Phase change data

Data compiled by: José A. Martinho Simões
Quantity | Value | Units | Method | Reference | Comment |
---|---|---|---|---|---|
ΔsubH° | 108. ± 8. | kJ/mol | RSC | Calhorda, Dias, et al., 1984 |

Gas phase thermochemistry data

Data compiled by: José A. Martinho Simões

Quantity Value Units Method Reference Comment
Δfgas-160. ± 13.kJ/molReviewMartinho SimõesThe enthalpy of formation relies on -383.6 ± 7.7 kJ/mol for the enthalpy of formation of Ti(Cp)2(Cl)2(cr)

References

Calhorda, Dias, et al., 1984
Calhorda, M.J.; Dias, A.R.; Martinho Simões, J.A.; Teixeira, C.,
J. Chem. Soc., Dalton Trans., 1984, 2659.. [all data]