Ti(Cp)2(SEt)2
- Formula: C14H20S2Ti
- Molecular weight: 300.306

Gas phase thermochemistry data

Data compiled by: José A. Martinho Simões
Quantity | Value | Units | Method | Reference | Comment |
---|---|---|---|---|---|
ΔfH°gas | -25.3 ± 3.1 | kcal/mol | Review | Martinho Simões | The enthalpy of formation relies on -91.7 ± 1.8 kcal/mol for the enthalpy of formation of Ti(Cp)2(Cl)2(cr) |

Condensed phase thermochemistry data

Data compiled by: José A. Martinho Simões
Quantity | Value | Units | Method | Reference | Comment |
---|---|---|---|---|---|
ΔfH°solid | -50.6 ± 2.0 | kcal/mol | Review | Martinho Simões | The enthalpy of formation relies on -91.7 ± 1.8 kcal/mol for the enthalpy of formation of Ti(Cp)2(Cl)2(cr) |

Phase change data

Data compiled by: José A. Martinho Simões
Quantity | Value | Units | Method | Reference | Comment |
---|---|---|---|---|---|
ΔsubH° | 25.3 ± 2.4 | kcal/mol | RSC | Calhorda, Carrondo, et al., 1988 |

References

Martinho Simões
Martinho Simões, J.A.,
Private communication (see http://webbook.nist.gov/chemistry/om/). [all data]
Calhorda, Carrondo, et al., 1988
Calhorda, M.J.; Carrondo, M.A.A.F. de C.T.; Dias, A.R.; Frazão, C.F.; Hursthouse, M.B.; Martinho Simões, J.A.; Teixeira, C.,
Inorg. Chem., 1988, 27, 2513. [all data]