Ti(Cp)2(N3)2
- Formula: C10H10N6Ti
- Molecular weight: 262.094

Condensed phase thermochemistry data

Data compiled by: José A. Martinho Simões
Quantity | Value | Units | Method | Reference | Comment |
---|---|---|---|---|---|
ΔfH°solid | 436. ± 13. | kJ/mol | Review | Martinho Simões | The enthalpy of formation relies on -383.6 ± 7.7 kJ/mol for the enthalpy of formation of Ti(Cp)2(Cl)2(cr) |

Phase change data

Data compiled by: José A. Martinho Simões
Quantity | Value | Units | Method | Reference | Comment |
---|---|---|---|---|---|
ΔsubH° | 70. ± 10. | kJ/mol | RSC | Calhorda, Gomes da Costa, et al., 1982 |

Reaction thermochemistry data

Data compiled by: José A. Martinho Simões
Individual Reactions
C10H10N6Ti (cr) + 2( • 4.18
) (solution) =
(cr) + 2
(g)
By formula: C10H10N6Ti (cr) + 2(HCl • 4.18H2O) (solution) = C10H10Cl2Ti (cr) + 2HN3 (g)
Quantity | Value | Units | Method | Reference | Comment |
---|---|---|---|---|---|
ΔrH° | 75.7 ± 5.8 | kJ/mol | RSC | Calhorda, Gomes da Costa, et al., 1982 | Please also see Dias, Dias, et al., 1987. |

Gas phase thermochemistry data

Data compiled by: José A. Martinho Simões
Quantity | Value | Units | Method | Reference | Comment |
---|---|---|---|---|---|
ΔfH°gas | 506. ± 16. | kJ/mol | Review | Martinho Simões | The enthalpy of formation relies on -383.6 ± 7.7 kJ/mol for the enthalpy of formation of Ti(Cp)2(Cl)2(cr) |

References

Martinho Simões
Martinho Simões, J.A.,
Private communication (see http://webbook.nist.gov/chemistry/om/). [all data]
Calhorda, Gomes da Costa, et al., 1982
Calhorda, M.J.; Gomes da Costa, R.; Dias, A.R.; Martinho Simões, J.A.,
J. Chem. Soc., Dalton Trans., 1982, 2327.. [all data]
Dias, Dias, et al., 1987
Dias, A.R.; Dias, P.B.; Diogo, H.P.; Galvão, A.M.; Minas da Piedade, M.E.; Martinho Simões, J.A.,
Organometallics, 1987, 6, 1427. [all data]