Ti(Cp)2(OOCCCl3)2
- Formula: C14H10Cl6O4Ti
- Molecular weight: 502.812

Gas phase thermochemistry data

Data compiled by: José A. Martinho Simões
Quantity | Value | Units | Method | Reference | Comment |
---|---|---|---|---|---|
ΔfH°gas | -965. ± 20. | kJ/mol | Review | Martinho Simões | The enthalpy of formation relies on -383.6 ± 7.7 kJ/mol for the enthalpy of formation of Ti(Cp)2(Cl)2(cr) |

Reaction thermochemistry data

Data compiled by: José A. Martinho Simões
Individual Reactions
C14H10Cl6O4Ti (cr) + 2( • 4.40
) (solution) =
(cr) + 2
(cr)
By formula: C14H10Cl6O4Ti (cr) + 2(HCl • 4.40H2O) (solution) = C10H10Cl2Ti (cr) + 2C2HCl3O2 (cr)
Quantity | Value | Units | Method | Reference | Comment |
---|---|---|---|---|---|
ΔrH° | 13.4 ± 2.6 | kJ/mol | RSC | Dias, Salema, et al., 1984 | Please also see Calhorda, Carrondo, et al., 1986. |

Condensed phase thermochemistry data

Data compiled by: José A. Martinho Simões
Quantity | Value | Units | Method | Reference | Comment |
---|---|---|---|---|---|
ΔfH°solid | -1095. ± 19. | kJ/mol | Review | Martinho Simões | The enthalpy of formation relies on -383.6 ± 7.7 kJ/mol for the enthalpy of formation of Ti(Cp)2(Cl)2(cr) |

References

Martinho Simões
Martinho Simões, J.A.,
Private communication (see http://webbook.nist.gov/chemistry/om/). [all data]
Dias, Salema, et al., 1984
Dias, A.R.; Salema, M.S.; Martinho Simões, J.A.,
Rev. Port. Quím., 1984, 26, 227. [all data]
Calhorda, Carrondo, et al., 1986
Calhorda, M.J.; Carrondo, M.A.A.F.C.T.; Dias, A.R.; Domingos, A.M.T.S.; Martinho Simões, J.A.; Teixeira, C.,
Organometallics, 1986, 5, 660. [all data]