Ti(Cp)2(OOCCF3)2
- Formula: C14H10F6O4Ti
- Molecular weight: 404.084

Gas phase thermochemistry data

Data compiled by: José A. Martinho Simões
Quantity | Value | Units | Method | Reference | Comment |
---|---|---|---|---|---|
ΔfH°gas | -2145. ± 12. | kJ/mol | Review | Martinho Simões | The enthalpy of formation relies on -383.6 ± 7.7 kJ/mol for the enthalpy of formation of Ti(Cp)2(Cl)2(cr) |

Condensed phase thermochemistry data

Data compiled by: José A. Martinho Simões
Quantity | Value | Units | Method | Reference | Comment |
---|---|---|---|---|---|
ΔfH°solid | -2252.8 ± 8.6 | kJ/mol | Review | Martinho Simões | The enthalpy of formation relies on -383.6 ± 7.7 kJ/mol for the enthalpy of formation of Ti(Cp)2(Cl)2(cr) |

Reaction thermochemistry data

Data compiled by: José A. Martinho Simões

Individual Reactions

C14H10F6O4Ti (cr) + 2(Hydrogen chloride • 4.40Water) (solution) = Titanocene dichloride (cr) + 2Trifluoroacetic acid (l)

By formula: C14H10F6O4Ti (cr) + 2(HCl • 4.40H2O) (solution) = C10H10Cl2Ti (cr) + 2C2HF3O2 (l)

Quantity Value Units Method Reference Comment
Δr37.8 ± 2.3kJ/molRSCCalado, Dias, et al., 1981Please also see Calhorda, Carrondo, et al., 1986.

References

Martinho Simões
Martinho Simões, J.A.,
Private communication (see http://webbook.nist.gov/chemistry/om/). [all data]