Ti(Cp)2(OOCPh)2
- Formula: C24H20O4Ti
- Molecular weight: 420.280

Condensed phase thermochemistry data

Data compiled by: José A. Martinho Simões
Quantity | Value | Units | Method | Reference | Comment |
---|---|---|---|---|---|
ΔfH°solid | -967. ± 13. | kJ/mol | Review | Martinho Simões | |
ΔfH°solid | -790.8 ± 8.3 | kJ/mol | Review | Martinho Simões | The enthalpy of formation relies on -383.6 ± 7.7 kJ/mol for the enthalpy of formation of Ti(Cp)2(Cl)2(cr) |
Quantity | Value | Units | Method | Reference | Comment |
ΔcH°solid | -12280. ± 13. | kJ/mol | CC-SB | Tel' noi, Rabinovich, et al., 1971 | Please also see Pedley and Rylance, 1977 and Tel'noi and Rabinovich, 1977. |

Phase change data

Data compiled by: José A. Martinho Simões
Quantity | Value | Units | Method | Reference | Comment |
---|---|---|---|---|---|
ΔsubH° | 112. ± 8. | kJ/mol | CC-SB | Calado, Dias, et al., 1981 |

Gas phase thermochemistry data

Data compiled by: José A. Martinho Simões
Quantity | Value | Units | Method | Reference | Comment |
---|---|---|---|---|---|
ΔfH°gas | -204.2 ± 3.7 | kcal/mol | Review | Martinho Simões | |
ΔfH°gas | -162.2 ± 2.7 | kcal/mol | Review | Martinho Simões | The enthalpy of formation relies on -91.7 ± 1.8 kcal/mol for the enthalpy of formation of Ti(Cp)2(Cl)2(cr) |

References

Martinho Simões
Martinho Simões, J.A.,
Private communication (see http://webbook.nist.gov/chemistry/om/). [all data]
Tel' noi, Rabinovich, et al., 1971
Tel' noi, V.I.; Rabinovich, I.B.; Latyaeva, V.N.; Lineva, A.N.,
Dokl. Akad. Nauk SSSR, 1971, 197, 353. [all data]
Pedley and Rylance, 1977
Pedley, J.B.; Rylance, J.,
Computer Analysed Thermochemical Data: Organic and Organometallic Compounds, University of Sussex, Brigton, 1977. [all data]
Tel'noi and Rabinovich, 1977
Tel'noi, V.I.; Rabinovich, I.B.,
Russ. Chem. Rev., 1977, 46, 689. [all data]
Calado, Dias, et al., 1981
Calado, J.C.G.; Dias, A.R.; Salema, M.S.; Martinho Simões, J.A.,
J. Chem. Soc., Dalton Trans., 1981, 1174.. [all data]