Ti(Cp)2(4-MeOC6H4)2
- Formula: C24H24O2Ti
- Molecular weight: 392.313

Condensed phase thermochemistry data

Data compiled by: José A. Martinho Simões
Quantity | Value | Units | Method | Reference | Comment |
---|---|---|---|---|---|
ΔfH°solid | -92.0 ± 8.7 | kJ/mol | Review | Martinho Simões | The enthalpy of formation relies on -383.6 ± 7.7 kJ/mol for the enthalpy of formation of Ti(Cp)2(Cl)2(cr) |

Phase change data

Data compiled by: José A. Martinho Simões
Quantity | Value | Units | Method | Reference | Comment |
---|---|---|---|---|---|
ΔsubH° | 104. ± 8. | kJ/mol | RSC | Calhorda, Dias, et al., 1983 |

Gas phase thermochemistry data

Data compiled by: José A. Martinho Simões
Quantity | Value | Units | Method | Reference | Comment |
---|---|---|---|---|---|
ΔfH°gas | 2.9 ± 2.8 | kcal/mol | Review | Martinho Simões | The enthalpy of formation relies on -91.7 ± 1.8 kcal/mol for the enthalpy of formation of Ti(Cp)2(Cl)2(cr) |

References

Martinho Simões
Martinho Simões, J.A.,
Private communication (see http://webbook.nist.gov/chemistry/om/). [all data]
Calhorda, Dias, et al., 1983
Calhorda, M.J.; Dias, A.R.; Salema, M.S.; Martinho Simões, J.A.,
J. Organometal. Chem., 1983, 255, 81. [all data]