Ti(Cp)2(OPh)2
- Formula: C22H20O2Ti
- Molecular weight: 364.260

Gas phase thermochemistry data

Data compiled by: José A. Martinho Simões
Quantity | Value | Units | Method | Reference | Comment |
---|---|---|---|---|---|
ΔfH°gas | -297. ± 12. | kJ/mol | Review | Martinho Simões | The enthalpy of formation relies on -383.6 ± 7.7 kJ/mol for the enthalpy of formation of Ti(Cp)2(Cl)2(cr) |

Condensed phase thermochemistry data

Data compiled by: José A. Martinho Simões
Quantity | Value | Units | Method | Reference | Comment |
---|---|---|---|---|---|
ΔfH°solid | -394.4 ± 8.2 | kJ/mol | Review | Martinho Simões | The enthalpy of formation relies on -383.6 ± 7.7 kJ/mol for the enthalpy of formation of Ti(Cp)2(Cl)2(cr) |

Phase change data

Data compiled by: José A. Martinho Simões
Quantity | Value | Units | Method | Reference | Comment |
---|---|---|---|---|---|
ΔsubH° | 97. ± 8. | kJ/mol | RSC | Dias, Salema, et al., 1981 |

Reaction thermochemistry data

Data compiled by: José A. Martinho Simões
Individual Reactions
C22H20O2Ti (cr) + 2( • 5.55
) (solution) = 2
(cr) +
(cr)
By formula: C22H20O2Ti (cr) + 2(HCl • 5.55H2O) (solution) = 2C6H6O (cr) + C10H10Cl2Ti (cr)
Quantity | Value | Units | Method | Reference | Comment |
---|---|---|---|---|---|
ΔrH° | -5.8 ± 2.5 | kJ/mol | RSC | Dias, Salema, et al., 1981 | Please also see Calhorda, Carrondo, et al., 1986. |

References

Martinho Simões
Martinho Simões, J.A.,
Private communication (see http://webbook.nist.gov/chemistry/om/). [all data]
Dias, Salema, et al., 1981
Dias, A.R.; Salema, M.S.; Martinho Simões, J.A.,
J. Organometal. Chem., 1981, 222, 69. [all data]
Calhorda, Carrondo, et al., 1986
Calhorda, M.J.; Carrondo, M.A.A.F.C.T.; Dias, A.R.; Domingos, A.M.T.S.; Martinho Simões, J.A.; Teixeira, C.,
Organometallics, 1986, 5, 660. [all data]