Ti(Cp)2(Fc)2
- Formula: C30H28Fe2Ti
- Molecular weight: 548.100

Gas phase thermochemistry data

Data compiled by: José A. Martinho Simões
Quantity | Value | Units | Method | Reference | Comment |
---|---|---|---|---|---|
ΔfH°gas | 638. ± 19. | kJ/mol | Review | Martinho Simões | The enthalpy of formation relies on -383.6 ± 7.7 kJ/mol for the enthalpy of formation of Ti(Cp)2(Cl)2(cr) and on 154.9 ± 4.5 kJ/mol for the enthalpy of formation of Fe(Cp)2(cr) |

Condensed phase thermochemistry data

Data compiled by: José A. Martinho Simões
Quantity | Value | Units | Method | Reference | Comment |
---|---|---|---|---|---|
ΔfH°solid | 488. ± 11. | kJ/mol | Review | Martinho Simões | The enthalpy of formation relies on -383.6 ± 7.7 kJ/mol for the enthalpy of formation of Ti(Cp)2(Cl)2(cr) and on 154.9 ± 4.5 kJ/mol for the enthalpy of formation of Fe(Cp)2(cr) |

Phase change data

Data compiled by: José A. Martinho Simões
Quantity | Value | Units | Method | Reference | Comment |
---|---|---|---|---|---|
ΔsubH° | 150. ± 15. | kJ/mol | RSC | Dias, Salema, et al., 1982 |

Reaction thermochemistry data

Data compiled by: José A. Martinho Simões

Individual Reactions

C30H28Fe2Ti (cr) + 2(Hydrogen chloride • 4.40Water) (solution) = 2Ferrocene (cr) + Titanocene dichloride (cr)

By formula: C30H28Fe2Ti (cr) + 2(HCl • 4.40H2O) (solution) = 2C10H10Fe (cr) + C10H10Cl2Ti (cr)

Quantity Value Units Method Reference Comment
Δr-253.5 ± 4.5kJ/molRSCDias, Salema, et al., 1982Please also see Calhorda, Dias, et al., 1987.

References

Martinho Simões
Martinho Simões, J.A.,
Private communication (see http://webbook.nist.gov/chemistry/om/). [all data]