Ti(Cp)2(Ph)2
- Formula: C22H20Ti
- Molecular weight: 332.261

Condensed phase thermochemistry data

Data compiled by: José A. Martinho Simões
Quantity | Value | Units | Method | Reference | Comment |
---|---|---|---|---|---|
ΔfH°solid | 72. ± 13. | kJ/mol | Review | Martinho Simões | |
ΔfH°solid | 262.0 ± 9.1 | kJ/mol | Review | Martinho Simões | The enthalpy of formation relies on -383.6 ± 7.7 kJ/mol for the enthalpy of formation of Ti(Cp)2(Cl)2(cr) |
Quantity | Value | Units | Method | Reference | Comment |
ΔcH°solid | -12531. ± 13. | kJ/mol | CC-SB | Tel' noi, Rabinovich, et al., 1967 | Please also see Pedley and Rylance, 1977. |

Phase change data

Data compiled by: José A. Martinho Simões
Quantity | Value | Units | Method | Reference | Comment |
---|---|---|---|---|---|
ΔsubH° | 88. ± 8. | kJ/mol | RSC | Dias, Salema, et al., 1982 | |
ΔsubH° | 84. ± 10. | kJ/mol | CC-SB | Tel' noi, Rabinovich, et al., 1967 |

Gas phase thermochemistry data

Data compiled by: José A. Martinho Simões
Quantity | Value | Units | Method | Reference | Comment |
---|---|---|---|---|---|
ΔfH°gas | 155. ± 16. | kJ/mol | Review | Martinho Simões | |
ΔfH°gas | 350. ± 12. | kJ/mol | Review | Martinho Simões | The enthalpy of formation relies on -383.6 ± 7.7 kJ/mol for the enthalpy of formation of Ti(Cp)2(Cl)2(cr) |

References

Martinho Simões
Martinho Simões, J.A.,
Private communication (see http://webbook.nist.gov/chemistry/om/). [all data]
Tel' noi, Rabinovich, et al., 1967
Tel' noi, V.I.; Rabinovich, I.B.; Tikhonov, V.D.; Latyaeva, V.N.; Vyshmskaya, L.I.; Razuvaev, G.A.,
Dokl. Akad. Nauk SSSR, 1967, 174, 1374. [all data]
Pedley and Rylance, 1977
Pedley, J.B.; Rylance, J.,
Computer Analysed Thermochemical Data: Organic and Organometallic Compounds, University of Sussex, Brigton, 1977. [all data]
Dias, Salema, et al., 1982
Dias, A.R.; Salema, M.S.; Martinho Simões, J.A.,
Organometallics, 1982, 1, 971. [all data]