Ti(O-neo-Pe)4
- Formula: C20H44O4Ti
- Molecular weight: 396.428

Gas phase thermochemistry data

Data compiled by: José A. Martinho Simões
Quantity | Value | Units | Method | Reference | Comment |
---|---|---|---|---|---|
ΔfH°gas | -1824. ± 67. | kJ/mol | Review | Martinho Simões | The enthalpy of formation relies on -1461.2 ± 3.1 kJ/mol for the enthalpy of formation of Ti(OEt)4(l). The large uncertainty is due to the uncertainty assigned to the enthalpy of formation of neo-pentyl alcohol Pedley, 1994 |
ΔfH°gas | -1824. ± 67. | kJ/mol | Review | Martinho Simões | The enthalpy of formation of relies on -1461.2 ± 3.1 kJ/mol for the enthalpy of formation of Ti(OEt)4(l) and also on the reaction enthalpy Ti(NEt2)4(l) + 4EtOH(l) = Ti(OEt)4(l) + 4Et2NH(l), -278.7 ± 2.1 kJ/mol Bradley and Hillyer, 1966 Pedley and Rylance, 1977. The large uncertainty is due to the uncertainty assigned to the enthalpy of formation of neo-pentyl alcohol Pedley, 1994 |

Condensed phase thermochemistry data

Data compiled by: José A. Martinho Simões
Quantity | Value | Units | Method | Reference | Comment |
---|---|---|---|---|---|
ΔfH°liquid | -1901. ± 67. | kJ/mol | Review | Martinho Simões | The enthalpy of formation relies on -1461.2 ± 3.1 kJ/mol for the enthalpy of formation of Ti(OEt)4(l). The large uncertainty is due to the uncertainty assigned to the enthalpy of formation of neo-pentyl alcohol Pedley, 1994 |
ΔfH°liquid | -1901. ± 67. | kJ/mol | Review | Martinho Simões | The enthalpy of formation of relies on -1461.2 ± 3.1 kJ/mol for the enthalpy of formation of Ti(OEt)4(l) and also on the reaction enthalpy Ti(NEt2)4(l) + 4EtOH(l) = Ti(OEt)4(l) + 4Et2NH(l), -278.7 ± 2.1 kJ/mol Bradley and Hillyer, 1966 Pedley and Rylance, 1977. The large uncertainty is due to the uncertainty assigned to the enthalpy of formation of neo-pentyl alcohol Pedley, 1994 |

Phase change data

Data compiled by: José A. Martinho Simões
Quantity | Value | Units | Method | Reference | Comment |
---|---|---|---|---|---|
ΔvapH° | 77.4 ± 3.8 | kJ/mol | RSC | Bradley and Hillyer, 1966 | Please also see Pedley and Rylance, 1977. |

References

Martinho Simões
Martinho Simões, J.A.,
Private communication (see http://webbook.nist.gov/chemistry/om/). [all data]
Pedley, 1994
Pedley, J.B.,
Thermodynamic Data and Structures of Organic Compounds; Thermodynamics Research Center Data Series, Vol I, Thermodynamics Research Center, College Station, 1994. [all data]
Bradley and Hillyer, 1966
Bradley, D.C.; Hillyer, M.J.,
Thermochemistry of metal alkoxides. Part 2.?Heats of formation of some titanium alkoxides,
Trans. Faraday Soc., 1966, 62, 2374, https://doi.org/10.1039/tf9666202374
. [all data]
Pedley and Rylance, 1977
Pedley, J.B.; Rylance, J.,
Computer Analysed Thermochemical Data: Organic and Organometallic Compounds, University of Sussex, Brigton, 1977. [all data]