Ti(OPe)4
- Formula: C20H44O4Ti
- Molecular weight: 396.428

Gas phase thermochemistry data

Data compiled by: José A. Martinho Simões
Quantity | Value | Units | Method | Reference | Comment |
---|---|---|---|---|---|
ΔfH°gas | -1662.2 ± 9.2 | kJ/mol | Review | Martinho Simões | The enthalpy of formation relies on -1461.2 ± 3.1 kJ/mol for the enthalpy of formation of Ti(OEt)4(l) |

Condensed phase thermochemistry data

Data compiled by: José A. Martinho Simões
Quantity | Value | Units | Method | Reference | Comment |
---|---|---|---|---|---|
ΔfH°liquid | -1766.8 ± 3.7 | kJ/mol | Review | Martinho Simões | The enthalpy of formation relies on -1461.2 ± 3.1 kJ/mol for the enthalpy of formation of Ti(OEt)4(l) |

References

Martinho Simões
Martinho Simões, J.A.,
Private communication (see http://webbook.nist.gov/chemistry/om/). [all data]