Ti(O-s-Bu)4
- Formula: C16H36O4Ti
- Molecular weight: 340.322

Condensed phase thermochemistry data

Data compiled by: José A. Martinho Simões
Quantity | Value | Units | Method | Reference | Comment |
---|---|---|---|---|---|
ΔfH°liquid | -1692.4 ± 4.4 | kJ/mol | Review | Martinho Simões | The enthalpy of formation relies on -1461.2 ± 3.1 kJ/mol for the enthalpy of formation of Ti(OEt)4(l) |

Phase change data

Data compiled by: José A. Martinho Simões
Quantity | Value | Units | Method | Reference | Comment |
---|---|---|---|---|---|
ΔvapH° | 92.0 ± 8.4 | kJ/mol | RSC | Bradley and Hillyer, 1966 | Please also see Pedley and Rylance, 1977. |

Gas phase thermochemistry data

Data compiled by: José A. Martinho Simões
Quantity | Value | Units | Method | Reference | Comment |
---|---|---|---|---|---|
ΔfH°gas | -382.5 ± 2.3 | kcal/mol | Review | Martinho Simões | The enthalpy of formation relies on -349.24 ± 0.74 kcal/mol for the enthalpy of formation of Ti(OEt)4(l) |

References

Martinho Simões
Martinho Simões, J.A.,
Private communication (see http://webbook.nist.gov/chemistry/om/). [all data]
Bradley and Hillyer, 1966
Bradley, D.C.; Hillyer, M.J.,
Thermochemistry of metal alkoxides. Part 2.?Heats of formation of some titanium alkoxides,
Trans. Faraday Soc., 1966, 62, 2374, https://doi.org/10.1039/tf9666202374
. [all data]
Pedley and Rylance, 1977
Pedley, J.B.; Rylance, J.,
Computer Analysed Thermochemical Data: Organic and Organometallic Compounds, University of Sussex, Brigton, 1977. [all data]