Ti(O-i-Pr)4
- Formula: C12H28O4Ti
- Molecular weight: 284.215

Condensed phase thermochemistry data

Data compiled by: José A. Martinho Simões
Quantity | Value | Units | Method | Reference | Comment |
---|---|---|---|---|---|
ΔfH°liquid | -1579.0 ± 3.9 | kJ/mol | Review | Martinho Simões | Selected data. The enthalpy of formation relies on -1461.2 ± 3.1 kJ/mol for the enthalpy of formation of Ti(OEt)4(l) |
ΔfH°liquid | -1557.9 ± 4.6 | kJ/mol | Review | Martinho Simões | |
ΔfH°liquid | -1629. ± 15. | kJ/mol | Review | Martinho Simões | |
Quantity | Value | Units | Method | Reference | Comment |
ΔcH°liquid | -8109.8 ± 4.2 | kJ/mol | CC-SB | Genchel, Volkova, et al., 1973 | Please also see Pedley and Rylance, 1977. |

Phase change data

Data compiled by: José A. Martinho Simões
Quantity | Value | Units | Method | Reference | Comment |
---|---|---|---|---|---|
ΔvapH° | 71.1 ± 8.4 | kJ/mol | RSC | Bradley and Hillyer, 1966 | Please also see Pedley and Rylance, 1977. |

Gas phase thermochemistry data

Data compiled by: José A. Martinho Simões

Quantity Value Units Method Reference Comment
Δfgas-1507.9 ± 9.3kJ/molReviewMartinho SimõesSelected data. The enthalpy of formation relies on -1461.2 ± 3.1 kJ/mol for the enthalpy of formation of Ti(OEt)4(l)
Δfgas-1486.8 ± 9.6kJ/molReviewMartinho Simões
Δfgas-1558. ± 17.kJ/molReviewMartinho Simões

References

Martinho Simões
Martinho Simões, J.A.,
Private communication (see http://webbook.nist.gov/chemistry/om/). [all data]
Genchel, Volkova, et al., 1973
Genchel, V.G.; Volkova, E.A.; Aizatullova, R.M.; Shaulov, Yu.Kh.,
Zh. Fiz. Khim., 1973, 47, 1133. [all data]
Pedley and Rylance, 1977
Pedley, J.B.; Rylance, J.,
Computer Analysed Thermochemical Data: Organic and Organometallic Compounds, University of Sussex, Brigton, 1977. [all data]
Bradley and Hillyer, 1966
Bradley, D.C.; Hillyer, M.J.,
Thermochemistry of metal alkoxides. Part 2.?Heats of formation of some titanium alkoxides,
Trans. Faraday Soc., 1966, 62, 2374, https://doi.org/10.1039/tf9666202374
. [all data]