Ti(Bz)4
- Formula: C28H28Ti
- Molecular weight: 412.389

Gas phase thermochemistry data

Data compiled by: José A. Martinho Simões
Quantity | Value | Units | Method | Reference | Comment |
---|---|---|---|---|---|
ΔfH°gas | 467. ± 12. | kJ/mol | Review | Martinho Simões | The enthalpy of formation relies on -1579.0 ± 3.9 kJ/mol for the enthalpy of formation of Ti(O-i-Pr)4(l) |

Condensed phase thermochemistry data

Data compiled by: José A. Martinho Simões
Quantity | Value | Units | Method | Reference | Comment |
---|---|---|---|---|---|
ΔfH°solid | 379.3 ± 8.3 | kJ/mol | Review | Martinho Simões | The enthalpy of formation relies on -1579.0 ± 3.9 kJ/mol for the enthalpy of formation of Ti(O-i-Pr)4(l) |

Phase change data

Data compiled by: José A. Martinho Simões
Quantity | Value | Units | Method | Reference | Comment |
---|---|---|---|---|---|
ΔsubH° | 21.0 ± 2.0 | kcal/mol | RSC | Lappert, Patil, et al., 1975 |

References

Martinho Simões
Martinho Simões, J.A.,
Private communication (see http://webbook.nist.gov/chemistry/om/). [all data]