U(Cp)3(OBu)
- Formula: C19H24OU
- Molecular weight: 506.4222

Condensed phase thermochemistry data

Data compiled by: José A. Martinho Simões
Quantity | Value | Units | Method | Reference | Comment |
---|---|---|---|---|---|
ΔfH°solid | -312. ± 21. | kJ/mol | Review | Martinho Simões | |
Quantity | Value | Units | Method | Reference | Comment |
ΔcH°solid | -11786. ± 21. | kJ/mol | CC-SB | Tel'noi, Rabinovich, et al., 1989 |

Gas phase thermochemistry data

Data compiled by: José A. Martinho Simões
Quantity | Value | Units | Method | Reference | Comment |
---|---|---|---|---|---|
ΔfH°gas | -45.7 ± 5.3 | kcal/mol | Review | Martinho Simões |

References

Martinho Simões
Martinho Simões, J.A.,
Private communication (see http://webbook.nist.gov/chemistry/om/). [all data]
Tel'noi, Rabinovich, et al., 1989
Tel'noi, V.I.; Rabinovich, I.B.; Larina, V.N.; Leonov, M.R.; Solov'eva, G.V.,
Radiokhimiya, 1989, 31, 38. [all data]